�S���n�������c�̃R�[�h,ID,�n�������c�̖�,����,����_�J�i,����_�p��,��Ë@�ւ̎��,���ݒn_�S���n�������c�̃R�[�h,����ID,���ݒn_�A���\�L,���ݒn_�s���{��,���ݒn_�s�撬��,���ݒn_����,���ݒn_�Ԓn�ȉ�,��������(����),�ܓx,�o�x,���x�̎��,���x�̒l,�d�b�ԍ�,�����ԍ�,FAX�ԍ�,�A���惁�[���A�h���X,�A����FormURL,�A������l�i���̑��ASNS�Ȃǁj,�X�֔ԍ�,�@�l�ԍ�,�@�l�̖���,��Ë@�փR�[�h,�f�×j��,�f�ÊJ�n����,�f�ÏI������,�f�Ó������L����,���ԊO�ɂ�����Ή�,�f�ÉȖ�,�a����,�ЊQ���_����,��,URL,�摜,�摜_���C�Z���X,���l
394289,1,���m��������,���������̐�f�Ï�,�N���V�I�`���E�R�u�V�m�J���V�������E�V��,,�����f�Ï�,394289,,���m�������S���������m��R�P�|�P,���m��,�����S���������m��R�P�|�P,,,,,,,,0880-55-7111,,,,,,,,,,���ΐ��؋�,9:30,17:00,�\�񐧁B12������14���܂ł͋x�f�B���j���̂ݐf�Î��Ԃ�12��30������14���܂ŁB,,����,,,,,,,
394289,2,���m��������,���������ۈɗ^��o���f�Ï�,�N���V�I�`���E�R�N�z�C���L�V���b�`���E�V�������E�V��,,�����f�Ï�,394289,,���m�������S�������ɗ^��Q�T�|�P,���m��,�����S�������ɗ^��Q�T�|�P,,,,,,,,0880-55-7111,,,,,,,,,,���ɂP����x�̊J��,,,�J�������͐��������������z�[���y�[�W�A�L�񎏂ɋL�ځB,,����,,,,,,,
394289,3,���m��������,���������ۗ�o���f�Ï�,�N���V�I�`���E�R�N�z�E�X�Y�V���b�`���E�V�������E�V��,,�����f�Ï�,394289,,���m�������S��������R�P�V�|�R,���m��,�����S��������R�P�V�|�R,,,,,,,,0880-55-7111,,,,,,,,,,���ɂP����x�̊J��,,,�J�������͐��������������z�[���y�[�W�A�L�񎏂ɋL�ځB,,����,,,,,,,
394289,4,���m��������,����f�Ï�,�T�K�V�������E�V��,,�����f�Ï�,394289,,���m�������S����������V�S�U�|�P,���m��,�����S����������V�S�U�|�P,,,,,,,,0880-55-2037,,,,,,,,��Ö@�l�ː���,,���ΐ��؋�,8:45,17:45,12��30������14���܂ŋx�f�B���_�ȁA�S�Ó��Ȃɂ��ẮA�u�T���j���̂ݐf�@�B,,���ȁA�_�o���ȁA���_�ȁA�S�Ó���,,,,,,,
394289,5,���m��������,����N���j�b�N,�I�I�K�^�N���j�b�N,,�a�@,394289,,���m�������S�������o���Q�O�V�O,���m��,�����S�������o���Q�O�V�O,,,,,,,,0880-43-2255,,,,,,,,��Ö@�l�l���\��,,���ΐ��؋�,8:30,17:00,12��30������13��30���܂ŋx�f�B�ؗj���͌ߑO���̂݁B,,���ȁA���n�r���e�[�V�����ȁA���ː���,,,,,,,
394289,6,���m��������,�o���N���j�b�N,�C�f�O�`�N���j�b�N,,�a�@,394289,,���m�������S����������Q�O�P�U�|�P,���m��,�����S����������Q�O�P�U�|�P,,,,,,,,0880-43-3331,,,,,,,,��Ö@�l����,,�����y,8:30,12:00,,,���ȁA���n�r���e�[�V������,,,,,,,
394289,7,���m��������,���ꎕ�Ȑf�Ï�,�T�K�V�J�V�������E�V��,,,394289,,���m�������S����������U�W�X�|�P,���m��,�����S����������U�W�X�|�P,,,,,,,,0880-55-3206,,,,,,,,,,���ؓy,9:00,18:30,12������14���܂ŋx�f�B�y�j����16��30���܂ŁB,,,,,,,,,
394289,8,���m��������,���J���Ȑf�Ï�,�I�_�j�V�J�V�������E�V��,,,394289,,���m�������S�����������W�V�V,���m��,�����S�����������W�V�V,,,,,,,,0880-44-1529,,,,,,,,,,���ΐ����y,12:00,18:00,�\�񐧁B,,,,,,,,,
394289,9,���m��������,�ō莕�Ȉ�@,�V�o�T�L�V�J�C�C��,,,394289,,���m�������S����������Q�X�S�O�|�P,���m��,�����S����������Q�X�S�O�|�P,,,,,,,,0880-43-1202,,,,,,,,,,���ΐ����y,9:00,17:00,,,,,,,,,,
394289,10,���m��������,�������Ȉ�@,���X�~�c�V�J�C�C��,,,394289,,���m�������S����������Q�T�W�P�|�P�|�P,���m��,�����S����������Q�T�W�P�|�P�|�P,,,,,,,,0880-43-4488,,,,,,,,,,���ΐ����y,9:00,18:00,,,,,,,,,,
394289,11,���m��������,�a�򎕉Ȉ�@,�C�Y�~�V�J�C�C��,,,394289,,���m�������S����������Q�O�W�Q�|�X,���m��,�����S����������Q�O�W�Q�|�X,,,,,,,,0880-43-3636,,,,,,,,,,���ΐ����y,9:30,16:30,12������14���܂ŋx�f�B,,,,,,,,,
394289,12,���m��������,�K��Ō�X�e�[�V�����ł����i�T�e���C�g�j,�z�E�����J���S�X�e�[�V�����f�A�C�i�T�e���C�g�j,,,394289,,���m�������S����������V�S�U�|�P,���m��,�����S����������V�S�U�|�P,,,,,,,,0880-55-3666,,,,,,,,��Ö@�l�ː���,,,,,,,,,,,,,,
394289,13,���m��������,�������,�T�K���b�L���N,,���ܖ��,394289,,���m�������S����������V�O�P�|�Q,���m��,�����S����������V�O�P�|�Q,,,,,,,,0880-55-3888,,,,,,,,,,���ΐ���,,,,,,,,,,,,
