�S���n�������c�̃R�[�h,ID,����,����_�J�i,����_�p��,���ݒn_�S���n�������c�̃R�[�h,����ID,���ݒn_�A���\�L,���ݒn_�s���{��,���ݒn_�s�撬��,���ݒn_����,���ݒn_�Ԓn�ȉ�,��������(����),�ܓx,�o�x,�W��,�d�b�ԍ�,�����ԍ�,�A���惁�[���A�h���X,�A����FormURL,�A������l�i���̑��ASNS�Ȃǁj,�X�֔ԍ�,�s�撬���R�[�h,�n�������c�̖�,�ЊQ���_�^��,�ЊQ���_�R����A�y�Η��y�ђn����,�ЊQ���_����,�ЊQ���_�n�k,�ЊQ���_�Ôg,�ЊQ���_��K�͂ȉΎ�,�ЊQ���_�����×�,�ЊQ���_�ΎR����,�w����Ƃ̏d��,�z����e�l��,�ΏۂƂȂ钬��E������,URL,�摜,�摜_���C�Z���X,���l
394289,1,��W��i�������C�Z���^�[�j,�X�Y�V���E�J�C�V���i�M���~���P���V���E�Z���^�[�j,,394289,,���m�������S��������Q�P�P�|�X,���m��,�����S��������Q�P�P�|�X,,,,33.12581028,133.1553453,,,,,,,,394289,���m��������,1,1,,,,1,,,1,1035�l,,,,,
394289,2,�����������鏬�w�Z,�L���E�N���V�I�`���E���c�X�Y�V���E�K�b�R�E,,394289,,���m�������S��������Q�P�O,���m��,�����S��������Q�P�O,,,,33.12670212,133.1566575,,,,,,,,394289,���m��������,,,,,,1,,,1,2763�l,,,,,
394289,3,������������ۈ珊,�L���E�N���V�I�`���E���c�X�Y�z�C�N�V��,,394289,,���m�������S��������Q�T�W,���m��,�����S��������Q�T�W,,,,33.12746585,133.1553647,,,,,,,,394289,���m��������,1,,1,,,,,,1,134�l,,,,,
394289,4,�s�쐣�W�,�C�`�m�Z�V���E�J�C�V��,,394289,,���m�������S�������s�쐣�T�S�V�|�P,���m��,�����S�������s�쐣�T�S�V�|�P,,,,33.16257236,133.1401179,,,,,,,,394289,���m��������,,1,,1,,,,,1,26�l,,,,,
394289,5,�k��W��i�k�쐶�����P�����j,�^�`�o�i�K���V���E�J�C�V���i�^�`�o�i�K���Z�C�J�c�J�C�[���Z���^�[�j,,394289,,���m�������S����������k��V�V�R,���m��,�����S����������k��V�V�R,,,,33.14927,133.132414,,,,,,,,394289,���m��������,,1,,1,,,,,1,117�l,,,,,
394289,6,�����������m�쏬�w�Z,�N���V�I�`���E���c�R�u�V�m�J���V���E�K�b�R�E,,394289,,���m�������S���������m��Q�S�R,���m��,�����S���������m��Q�S�R,,,,33.145481,133.120815,,0880-55-7355,,,,,,394289,���m��������,1,,,1,,1,,,1,9846�l,,,,,
394289,7,�������������m��ۈ珊,�L���E�N���V�I�`���E���c�R�u�V�m�J���z�C�N�V��,,394289,,���m�������S���������m��S�U�|�P,���m��,�����S���������m��S�U�|�P,,,,33.13627,133.123973,,,,,,,,394289,���m��������,1,,,1,,,,,1,2221�l,,,,,
394289,8,���ꉷ��@���Ԃ��̗�,�T�K�I���Z���@�R�u�V�m�T�g,,394289,,���m�������S���������m��Q�P�U�P,���m��,�����S���������m��Q�P�U�P,,,,33.13714865,133.1250987,,0880-55-7011,,,,,,394289,���m��������,1,1,1,1,,1,,,1,0�l,,,,,
394289,9,�����������ی��Z���^�[,�N���V�I�`���E�\�E�S�E�z�P���Z���^�[,,394289,,���m�������S���������m��R�P�|�P,���m��,�����S���������m��R�P�|�P,,,,33.13597811,133.1235933,,0880-55-7373,,,,,,394289,���m��������,,,,,,,,,1,175�l,,,,,
394289,10,�ی������x���Z���^�[���Ԃ�,�z�P���t�N�V�G���Z���^�[�R�u�V,,394289,,���m�������S���������m��P�V�|�R,���m��,�����S���������m��P�V�|�R,,,,33.135548,133.123282,,0880-55-7017,,,,,,394289,���m��������,,,,,1,1,,,1,355�l,,,,,
394289,11,���m��W�,�R�u�V�m�J���V���E�J�C�V��,,394289,,���m�������S���������m��Q�R�R�|�P,���m��,�����S���������m��Q�R�R�|�P,,,,33.144253,133.121601,,,,,,,,394289,���m��������,,,,1,,1,,,1,231�l,,,,,
394289,12,�׈�W�,�J�C�i�V���E�J�C�V��,,394289,,���m�������S�������׈�S�V�Q�|�Q,���m��,�����S�������׈�S�V�Q�|�Q,,,,33.132893,133.119883,,,,,,,,394289,���m��������,1,1,,1,,,,,1,17�l,,,,,
394289,13,�쉜�W�,�J���I�N�V���E�J�C�V��,,394289,,���m�������S�������쉜�Q�W�X,���m��,�����S�������쉜�Q�W�X,,,,33.140279,133.114331,,,,,,,,394289,���m��������,1,,,1,,,,,1,101�l,,,,,
394289,14,�����m��W�,�R�O���m�J���V���E�J�C�V��,,394289,,���m�������S�����������̐�P�T�U,���m��,�����S�����������̐�P�T�U,,,,33.123189,133.120882,,,,,,,,394289,���m��������,1,1,,1,,1,,,1,74�l,,,,,
394289,15,���m��W�,�i�J�m�J���V���E�J�C�V��,,394289,,���m�������S���������m��P�U�U,���m��,�����S���������m��P�U�U,,,,33.125651,133.134348,,,,,,,,394289,���m��������,,,,1,,1,,,1,17�l,,,,,
394289,16,�s�j���W�,�t�o�n���V���E�J�C�V��,,394289,,���m�������S�������s�j���S�Q�T�|�R,���m��,�����S�������s�j���S�Q�T�|�R,,,,33.109466,133.109865,,,,,,,,394289,���m��������,1,,,1,,,,,1,20�l,,,,,
394289,17,�s��X��c�n�W�,�C�`�m�m�K���_���`�V���E�J�C�V��,,394289,,���m�������S�������s��X��X�|�Q,���m��,�����S�������s��X��X�|�Q,,,,33.110921,133.103201,,,,,,,,394289,���m��������,,,,1,,,,,1,67�l,,,,,
394289,18,�s��X��W�,�C�`�m�m�K���V���E�J�C�V��,,394289,,���m�������S�������s��X��X�T�T�|�Q,���m��,�����S�������s��X��X�T�T�|�Q,,,,33.11826957,133.1019023,,,,,,,,394289,���m��������,1,1,,1,,1,,,1,134�l,,,,,
394289,19,���������ɗ^�쏬�w�Z,�N���V�I�`���E���c�C���L�V���E�K�b�R�E,,394289,,���m�������S�������ɗ^��V�W,���m��,�����S�������ɗ^��V�W,,,,33.10521605,133.1000241,,0880-55-2069,,,,,,394289,���m��������,,,,1,,1,,,1,10705�l,,,,,
394289,20,������������ۈ珊,�N���V�I�`���E���c�T�K�z�C�N�V��,,394289,,���m�������S�������ɗ^��699-1,���m��,�����S�������ɗ^��699-1,,,,33.1049043,133.1015804,,0880-55-2117,,,,,,394289,���m��������,1,,,1,,1,,,1,1208�l,,,,,
394289,21,�ɗ^��W�,�C���L�V���E�J�C�V��,,394289,,���m�������S�������ɗ^��R�T�S,���m��,�����S�������ɗ^��R�T�S,,,,33.107971,133.095556,,,,,,,,394289,���m��������,,,,1,,,,,1,24�l,,,,,
394289,22,�F��W�,�N�}�C�V���E�J�C�V��,,394289,,���m�������S�������F��Q�V�X�|�R,���m��,�����S�������F��Q�V�X�|�R,,,,33.1002061,133.1017467,,,,,,,,394289,���m��������,,,,1,,,,,1,20�l,,,,,
394289,23,�����X�ёg��,�o���h�E�V�������N�~�A�C,,394289,,���m�������S�������F��346-8,���m��,�����S�������F��346-8,,,,33.1002632,133.0962377,,0880-55-2021,,,,,,394289,���m��������,1,1,,1,1,1,,,1,153�l,,,,,
394289,24,����W�,�t�W�i���V���E�J�C�V��,,394289,,���m�������S����������V�W�S�|�R,���m��,�����S����������V�W�S�|�R,,,,33.095986,133.092038,,,,,,,,394289,���m��������,,,,,,,,,1,18�l,,,,,
394289,25,�F��Y�W�,�N�}�m�E���V���E�J�C�V��,,394289,,���m�������S�������F��Y�X�O�|�R,���m��,�����S�������F��Y�X�O�|�R,,,,33.10063377,133.142369,,,,,,,,394289,���m��������,1,1,1,1,1,1,,,1,480�l,,,,,
394289,26,�㕪�W�,�J�~�u���V���E�J�C�V��,,394289,,���m�������S����������P�U�O�S,���m��,�����S����������P�U�O�S,,,,33.09111101,133.099016,,,,,,,,394289,���m��������,,,,,,,,,1,28�l,,,,,
394289,27,��܏W�,�T�R���V���E�J�C�V��,,394289,,���m�������S����������Q�T�U�O�|�U,���m��,�����S����������Q�T�U�O�|�U,,,,33.08463325,133.096773,,,,,,,,394289,���m��������,1,,,,,,,,1,1024�l,,,,,
394289,28,�n�n�W�,�E�}�W�V���E�J�C�V��,,394289,,���m�������S����������Q�V�T�V�|�Q,���m��,�����S����������Q�V�T�V�|�Q,,,,33.080289,133.099213,,,,,,,,394289,���m��������,,1,,,,,,,1,78�l,,,,,
394289,29,�����������Z���^�[,�N���V�I�`���E�\�E�S�E�Z���^�[,,394289,,���m�������S����������P�O�W�O�|�P,���m��,�����S����������P�O�W�O�|�P,,,,33.07953026,133.1028307,,0880-55-3371,,,,,,394289,���m��������,,1,1,,,1,,,1,4548�l,,,,,
394289,30,JA���m�͂�����x��,�W�F�C�G�C�R�E�`�n�^�T�K�V�V��,,394289,,���m�������S����������W�W�W,���m��,�����S����������W�W�W,,,,33.08078774,133.1046457,,0880-55-2511,,,,,,394289,���m��������,1,1,1,,,,,,1,3175�l,,,,,
394289,31,�����������ꒆ�w�Z,�N���V�I�`���E���c�T�K�`���E�K�b�R�E,,394289,,���m�������S����������U�O�O,���m��,�����S����������U�O�O,,,,33.0824651,133.1064066,,0880-55-2027,,,,,,394289,���m��������,1,,1,,,1,,,1,20804�l,,,,,
394289,32,�����������ꏬ�w�Z,�N���V�I�`���E���c�T�K�V���E�K�b�R�E,,394289,,���m�������S����������X�U�O,���m��,�����S����������X�U�O,,,,33.082311,133.1047564,,0880-55-2032,,,,,,394289,���m��������,1,,1,,,1,,,1,12061�l,,,,,
394289,33,��������������ۈ珊,�L���E�N���V�I�`���E���c�T�K�z�C�N�V��,,394289,,���m�������S����������X�U�V�|�P,���m��,�����S����������X�U�V�|�P,,,,33.08178382,133.1051585,,,,,,,,394289,���m��������,1,,1,,,1,,,1,2759�l,,,,,
394289,34,���ꋙ��,�T�K�M���L���E,,394289,,���m�������S����������R�W�P,���m��,�����S����������R�W�P,,,,33.07768424,133.1105327,,0880-55-3131,,,,,,394289,���m��������,1,,,,,,,,1,70�l,,,,,
394289,35,�������C�Z���^�[,�M���~���P���V���E�Z���^�[,,394289,,���m�������S����������V�V�R�|�U,���m��,�����S����������V�V�R�|�U,,,,33.07854994,133.1083884,,,,,,,,394289,���m��������,1,1,1,,,1,,,1,0�l,,,,,
394289,36,�����������꒬����,�N���V�I�`���E���c�T�K�`���E�~���J��,,394289,,���m�������S����������Q�X�X�T�|�S�O,���m��,�����S����������Q�X�X�T�|�S�O,,,,33.07522309,133.1058677,,0880-55-2108,,,,,,394289,���m��������,1,1,,,,,,,1,308�l,,,,,
394289,37,�������������l�ۈ珊,�L���E�N���V�I�`���E���c���R�n�}�z�C�N�V��,,394289,,���m�������S����������R�T�R�V�|�P,���m��,�����S����������R�T�R�V�|�P,,,,33.07479496,133.1058621,,,,,,,,394289,���m��������,1,1,,,,1,,,1,1829�l,,,,,
394289,38,���������ʗ{��V�l�z�[���@�����ܑ�,�N���V�I�`���E�g�N�x�c���E�S���E�W���z�[���@�J�V�}�\�E,,394289,,���m�������S����������R�P�V�V,���m��,�����S����������R�P�V�V,,,,33.06241228,133.1058112,,0880-55-3591,,,,,,394289,���m��������,1,1,1,1,1,1,,,1,616�l,,,,,
394289,39,�������f�B�T�[�r�X�Z���^�[�@�������Y,�N���V�I�`���E�f�C�T�[�r�X�Z���^�[�@�J�V�}�K�E��,,394289,,���m�������S����������R�P�V�V�|�P�O,���m��,�����S����������R�P�V�V�|�P�O,,,,33.0631133,133.1060757,,0880-55-3555,,,,,,394289,���m��������,1,1,1,1,1,1,,,1,122�l,,,,,
394289,40,���l�W�,�V���n�}�V���E�J�C�V��,,394289,,���m�������S���������l�P�X,���m��,�����S���������l�P�X,,,,33.057405,133.098384,,,,,,,,394289,���m��������,,,,,,,,,1,21�l,,,,,
394289,41,��W�,�i�_�V���E�J�C�V��,,394289,,���m�������S��������S�R�Q,���m��,�����S��������S�R�Q,,,,33.033137,133.093349,,,,,,,,394289,���m��������,1,,,,,,,,1,251�l,,,,,
394289,42,�������h��,�N���V�I�V���E�{�E�V��,,394289,,���m�������S�������ɓc�Q�U�Q�X�|�P,���m��,�����S�������ɓc�Q�U�Q�X�|�P,,,,33.03220466,133.0817575,,0880-44-2600,,,,,,394289,���m��������,1,1,1,1,1,1,,,1,7928�l,,,,,
394289,43,�����������ɓc���w�Z,�L���E�N���V�I�`���E���c�C�_�V���E�K�b�R�E,,394289,,���m�������S�������ɓc�T�U�T,���m��,�����S�������ɓc�T�U�T,,,,33.03705107,133.0739121,,,,,,,,394289,���m��������,1,1,1,,,1,,,1,3943�l,,,,,
394289,44,�����������ɓc�ۈ珊,�L���E�N���V�I�`���E���c�C�_�z�C�N�V��,,394289,,���m�������S�������ɓc�W�O�W,���m��,�����S�������ɓc�W�O�W,,,,33.03555721,133.0772754,,,,,,,,394289,���m��������,1,1,1,,,1,,,1,1004�l,,,,,
394289,45,�ɓc�Y�V�l�e�̉�,�C�_�E�����E�W���C�R�C�m�C�G,,394289,,���m�������S�������ɓc�U�T�S,���m��,�����S�������ɓc�U�T�S,,,,33.035727,133.074161,,,,,,,,394289,���m��������,1,,,,,,,,1,175�l,,,,,
394289,46,�ɓc���W�,�C�_�S�E�V���E�J�C�V��,,394289,,���m�������S�������ɓc�W�V�P�|�C,���m��,�����S�������ɓc�W�V�P�|�C,,,,33.036321,133.078498,,,,,,,,394289,���m��������,1,,,,,,,,1,394�l,,,,,
394289,47,�L��쑽�ړI���C�W��{��,�A���C�K���^���N�e�L�P���V���E�V���E�J�C�V�Z�c,,394289,,���m�������S�������L���P�W�O�X�|�P,���m��,�����S�������L���P�W�O�X�|�P,,,,33.03822415,133.0703366,,,,,,,,394289,���m��������,1,1,,,,1,,,1,3329�l,,,,,
394289,48,���ʗ{��V�l�z�[���@�V�[�T�C�h�z�[��,�g�N�x�c���E�S���E�W���z�[���@�V�[�T�C�h�z�[��,,394289,,���m�������S�������L���P�Q�|�P,���m��,�����S�������L���P�Q�|�P,,,,33.03843415,133.0609075,,0880-44-1911,,,,,,394289,���m��������,1,1,1,1,1,1,,,1,1197�l,,,,,
394289,49,�ʏ����{�݂�������,�c�E�V���J�C�S�V�Z�c�V�I�J�[,,394289,,���m�������S�������L���P�Q�|�P,���m��,�����S�������L���P�Q�|�P,,,,33.0375163,133.0608414,,0880-44-1966,,,,,,394289,���m��������,1,1,1,1,1,,,,1,243�l,,,,,
394289,50,�����������������ۈ珊,�N���V�I�`���E���c�I�I�K�^�N�W���z�C�N�V��,,394289,,���m�������S�����������P�O�U�W�|�P,���m��,�����S�����������P�O�U�W�|�P,,,,33.04106997,133.0517395,,0880-44-1112,,,,,,394289,���m��������,1,1,1,1,1,1,,,1,6032�l,,,,,
394289,51,���m�����������N�̉�,�R�E�`�P�����c�n�^�Z�C�V���E�l���m�C�G,,394289,,���m�������S�����������P�P�U�U,���m��,�����S�����������P�P�U�U,,,,33.04063827,133.0492826,,0880-44-1001,,,,,,394289,���m��������,1,1,1,1,1,1,,,1,48836�l,,,,,
394289,52,���������������w�Z,�N���V�I�`���E���c�J�~�J���O�`�V���E�K�b�R�E,,394289,,���m�������S�����������T�U�X,���m��,�����S�����������T�U�X,,,,33.04139674,133.0574466,,0880-44-1127,,,,,,394289,���m��������,1,,1,,,1,,,1,5093�l,,,,,
394289,53,���������������ۈ珊,�L���E�N���V�I�`���E���c�J�~�J���O�`�z�C�N�V��,,394289,,���m�������S�����������T�U�S�|�Q,���m��,�����S�����������T�U�S�|�Q,,,,33.04157361,133.0580923,,,,,,,,394289,���m��������,1,,1,,,1,,,1,1424�l,,,,,
394289,54,�����Y�W�,�J�~�J���O�`�E���V���E�J�C�V��,,394289,,���m�������S�����������V�R�R�|�W,���m��,�����S�����������V�R�R�|�W,,,,33.0401957,133.0581064,,,,,,,,394289,���m��������,,,,,,,,,1,61�l,,,,,
394289,55,�������W���Z���^�[,�J�~�J���O�`�S�E�V���E���N�Z���^�[,,394289,,���m�������S�����������W�W�T�|�W,���m��,�����S�����������W�W�T�|�W,,,,33.04281,133.056251,,,,,,,,394289,���m��������,1,1,1,,,,,,1,265�l,,,,,
394289,56,���}���������i���}�W��j,�I�E���J�G�W�h�E�R�E�G���i�I�E���J�G�V���E�J�C�V���j,,394289,,���m�������S�����������P�Q�T�Q�|�Q,���m��,�����S�����������P�Q�T�Q�|�Q,,,,33.03979534,133.0484075,,,,,,,,394289,���m��������,1,1,1,1,1,1,,,1,170�l,,,,,
394289,57,�����W�,�I�E�i�V�V���E�J�C�V��,,394289,,���m�������S�����������P�S�X�X�|�Q,���m��,�����S�����������P�S�X�X�|�Q,,,,33.03817908,133.0420426,,,,,,,,394289,���m��������,1,1,1,,,1,,,1,86�l,,,,,
394289,58,吐쌒�N�x���Z���^�[,�~�i�K���P���R�E�V�G���Z���^�[,,394289,,���m�������S������吐�U�U�U,���m��,�����S������吐�U�U�U,,,,33.05953666,133.043121,,,,,,,,394289,���m��������,1,,1,1,1,1,,,1,2841�l,,,,,
394289,59,��������吐�ӂꂠ���Z���^�[,�N���V�I�`���E���c�~�i�K���t���A�C�Z���^�[,,394289,,���m�������S������吐�U�U�U,���m��,�����S������吐�U�U�U,,,,33.05967677,133.0432335,,,,,,,,394289,���m��������,1,,1,1,1,1,,,1,354�l,,,,,
394289,60,吐쐶�����P�Z���^�[,�~�i�K���Z�C�J�c�J�C�[���Z���^�[,,394289,,���m�������S������吐�W�O�Q,���m��,�����S������吐�W�O�Q,,,,33.05981501,133.04276,,,,,,,,394289,���m��������,1,,1,1,1,1,,,1,568�l,,,,,
394289,61,�Č��W�,�R���n���V���E�J�C�V��,,394289,,���m�������S������吐�Q�U�R�O,���m��,�����S������吐�Q�U�R�O,,,,33.088391,133.067484,,,,,,,,394289,���m��������,1,,1,1,,1,,,1,55�l,,,,,
394289,62,������W�,�i�J�u�R�E�V���E�J�C�V��,,394289,,���m�������S������吐�R�U�S�X�|�P,���m��,�����S������吐�R�U�S�X�|�P,,,,33.07636437,133.0376077,,,,,,,,394289,���m��������,1,,1,1,,1,,,1,38�l,,,,,
394289,63,�����Y�W�,�o���_���E�V���E�J�C�V��,,394289,,���m�������S������吐�R�V�P�R�|�P�R,���m��,�����S������吐�R�V�P�R�|�P�R,,,,33.09872454,133.0520959,,,,,,,,394289,���m��������,1,,1,1,,1,,,1,305�l,,,,,
394289,64,���ÏW���Z���^�[,�E�L�c�V���E���N�Z���^�[,,394289,,���m�������S���������ڂR�T�W�W�|�P,���m��,�����S���������ڂR�T�W�W�|�P,,,,33.038173,133.037353,,,,,,,,394289,���m��������,1,1,,,,,,,1,224�l,,,,,
394289,65,���Ô��W�,�E�L�c�q�i���V���E�J�C�V��,,394289,,���m�������S���������ڂQ�V�O�S,���m��,�����S���������ڂQ�V�O�S,,,,33.039428,133.03709,,,,,,,,394289,���m��������,1,1,1,1,1,1,,,1,407�l,,,,,
394289,66,���������������ۈ珊,�L���E�N���V�I�`���E���c�g�E�u�z�C�N�V��,,394289,,���m�������S���������ڂR�X�T�S�|�P,���m��,�����S���������ڂR�X�T�S�|�P,,,,33.0351811,133.0288259,,,,,,,,394289,���m��������,1,1,,,,1,,,1,1142�l,,,,,
394289,67,���������싽���w�Z,�N���V�I�`���E���c�i���S�E�V���E�K�b�R�E,,394289,,���m�������S���������ڂV�P�V,���m��,�����S���������ڂV�P�V,,,,33.03780985,133.0260668,,0880-43-1124,,,,,,394289,���m��������,1,,,,,1,,,1,1429�l,,,,,
394289,68,�ڏW�,�u�`�V���E�J�C�V��,,394289,,���m�������S���������ڂP�X�S�S�|�P,���m��,�����S���������ڂP�X�S�S�|�P,,,,33.037877,133.033147,,,,,,,,394289,���m��������,1,1,1,1,1,1,,,1,223�l,,,,,
394289,69,�ژV�l�e�̉�,�u�`���E�W���C�R�C�m�C�G,,394289,,���m�������S���������ڂR�X�T�R,���m��,�����S���������ڂR�X�T�R,,,,33.035318,133.030089,,,,,,,,394289,���m��������,,,,,,,,,1,1825�l,,,,,
394289,70,�O��W�,�q���m�V���E�J�C�V��,,394289,,���m�������S���������ڂR�O�O,���m��,�����S���������ڂR�O�O,,,,33.03549926,133.0237119,,,,,,,,394289,���m��������,1,1,1,1,1,1,,,1,46�l,,,,,
394289,71,�y�����[�g�s�A�J���g���[�N���u,�g�T���[�g�s�A�J���g���[�N���u,,394289,,���m�������S���������ڂR�W�V�W,���m��,�����S���������ڂR�W�V�W,,,,33.05408717,133.0377837,,0880-43-2345,,,,,,394289,���m��������,1,1,1,1,1,1,,,1,1308�l,,,,,
394289,72,�ڒn��h�Ђ܂��Â��苒�_�{�݁i�ڏ��h�ԏ��j,�u�`�`�N�{�E�T�C�}�`�d�N���L���e���V�Z�c�i�u�`�V���E�{�E�g���V���j,,394289,,���m�������S���������ڂP�W�Q�P,���m��,�����S���������ڂP�W�Q�P,,,,33.038912,133.032878,,,,,,,,394289,���m��������,1,1,1,1,1,1,,,1,241�l,,,,,
394289,73,������W�,�N�`�~�i�g�K���V���E�J�C�V��,,394289,,���m�������S������������X�X�U,���m��,�����S������������X�X�U,,,,33.05549253,133.0268635,,,,,,,,394289,���m��������,1,1,,1,1,1,,,1,35�l,,,,,
394289,74,������������ӂꂠ���Z���^�[,�N���V�I�`���E���c�~�i�g�K���t���A�C�Z���^�[,,394289,,���m�������S������������R�O�X�P,���m��,�����S������������R�O�X�P,,,,33.062958,133.02591,,,,,,,,394289,���m��������,1,1,,1,,1,,,1,2562�l,,,,,
394289,75,������V�l�e�̉�,�I�N�~�i�g�K�����E�W���C�R�C�m�C�G,,394289,,���m�������S������������R�P�O�Q,���m��,�����S������������R�P�O�Q,,,,33.062445,133.025953,,,,,,,,394289,���m��������,1,1,,1,,,,,1,194�l,,,,,
394289,76,������S��,�I�I�K�^�Z�C�V���G��,,394289,,���m�������S�����������R�R,���m��,�����S�����������R�R,,,,33.03951306,133.0215391,,0880-43-3666,,,,,,394289,���m��������,1,1,,1,1,1,,,1,1091�l,,,,,
394289,77,����W���Z���^�[,�I�K���V���E���N�Z���^�[,,394289,,���m�������S�����������P�Q�P�|�P,���m��,�����S�����������P�Q�P�|�P,,,,33.042933,133.020001,,,,,,,,394289,���m��������,1,,,,,,,,1,227�l,,,,,
394289,78,�������������ӂꂠ���Z���^�[,�N���V�I�`���E���c�J���`�t���A�C�Z���^�[,,394289,,���m�������S�����������R�P�W�P,���m��,�����S�����������R�P�W�P,,,,33.043066,133.010809,,,,,,,,394289,���m��������,1,,,,,1,,,1,3031�l,,,,,
394289,79,�c���W�,�^�����V���E�J�C�V��,,394289,,���m�������S�����������R�R�Q�O�|�P,���m��,�����S�����������R�R�Q�O�|�P,,,,33.041837,133.012567,,,,,,,,394289,���m��������,1,,,,,,,,1,186�l,,,,,
394289,80,�����{���W�,�J���`�z�������V���E�J�C�V��,,394289,,���m�������S�����������Q�P�W�U�|�S,���m��,�����S�����������Q�P�W�U�|�S,,,,33.049994,133.006092,,,,,,,,394289,���m��������,1,,,,,,,,1,83�l,,,,,
394289,81,�����������k�����w�Z,�L���E�N���V�I�`���E���c�z�N�S�E�V���E�K�b�R�E,,394289,,���m�������S������������W�T�O,���m��,�����S������������W�T�O,,,,33.05696344,132.9966346,,,,,,,,394289,���m��������,1,,,1,,1,,,1,1796�l,,,,,
394289,82,�剮���W�,�I�I���V�L�V���E�J�C�V��,,394289,,���m�������S������������W�T�R,���m��,�����S������������W�T�R,,,,33.05710136,132.9972345,,,,,,,,394289,���m��������,1,,,1,,,,,1,166�l,,,,,
394289,83,�{�J�W�,�z���^�j�V���E�J�C�V��,,394289,,���m�������S������������P�W�S�R�|�P,���m��,�����S������������P�W�S�R�|�P,,,,33.069241,132.996353,,,,,,,,394289,���m��������,1,,,1,,1,,,1,33�l,,,,,
394289,84,����W�,�I�I�C�K���V���E�J�C�V��,,394289,,���m�������S����������V�P,���m��,�����S����������V�P,,,,33.06550318,132.9823024,,,,,,,,394289,���m��������,1,1,,1,,,,,1,96�l,,,,,
394289,85,��������������ۈ珊,�L���E�N���V�I�`���E���c�n���T�L�z�C�N�V��,,394289,,���m�������S����������R�W�O�R�|�Q,���m��,�����S����������R�W�O�R�|�Q,,,,33.03457,133.0153825,,,,,,,,394289,���m��������,1,1,,,,,,,1,1327�l,,,,,
394289,86,����W�,�n���T�L�V���E�J�C�V��,,394289,,���m�������S����������R�V�X�X,���m��,�����S����������R�V�X�X,,,,33.034352,133.015069,,,,,,,,394289,���m��������,1,1,,,,,,,1,266�l,,,,,
394289,87,�l�X�g�E�E�F�X�g�K�[�f���y��,�l�X�g�E�G�X�g�K�[�f���g�T,,394289,,���m�������S����������P�W�S,���m��,�����S����������P�W�S,,,,33.01903,133.012088,,0880-43-0101,,,,,,394289,���m��������,,,,,,1,,,1,386�l,,,,,
394289,88,�ӂ邳�Ƒ����Z���^�[,�t���T�g�\�E�S�E�Z���^�[,,394289,,���m�������S����������P�V�U�|�Q,���m��,�����S����������P�V�U�|�Q,,,,33.02011433,133.01292,,0880-43-3369,,,,,,394289,���m��������,,,,,,1,,,1,456�l,,,,,
394289,89,�l�̋{�W�,�n�}�m�~���V���E�J�C�V��,,394289,,���m�������S����������Q�R�P�O�|�Q,���m��,�����S����������Q�R�P�O�|�Q,,,,33.02445423,133.0133483,,,,,,,,394289,���m��������,1,1,1,,,,,,1,115�l,,,,,
394289,90,�V���W�,�V���}�`�V���E�J�C�V��,,394289,,���m�������S����������P�S�R�W�|�C,���m��,�����S����������P�S�R�W�|�C,,,,33.0209064,133.0103936,,,,,,,,394289,���m��������,1,1,1,,,,,,1,53�l,,,,,
394289,91,�����������������,�N���V�I�`���E���c�I�I�K�^�`���E�~���J��,,394289,,���m�������S����������W�R�R�|�P,���m��,�����S����������W�R�R�|�P,,,,33.01846077,133.0081425,,0880-43-1204,,,,,,394289,���m��������,1,1,1,,,,,,1,361�l,,,,,
394289,92,���������l������W�,�N���V�I�`���E���c�n�}�}�c�L���E�C�N�V���E�J�C�V��,,394289,,���m�������S����������W�S�P�|�T,���m��,�����S����������W�S�P�|�T,,,,33.01848326,133.0080352,,,,,,,,394289,���m��������,1,1,1,,,,,,1,99�l,,,,,
394289,93,�����������������,�N���V�I�`���E���c�I�I�K�^�W�h�E�J��,,394289,,���m�������S����������W�V�R�|�Q/����W�V�R�|�R,���m��,�����S����������W�V�R�|�Q/����W�V�R�|�R,,,,33.01964811,133.0081634,,0880-43-3622,,,,,,394289,���m��������,1,1,1,,,,,,1,483�l,,,,,
394289,94,���������F���W�,�N���V�I�`���E���c���E�A�C�V���E�J�C�V��,,394289,,���m�������S����������W�T�S�|�R,���m��,�����S����������W�T�S�|�R,,,,33.019071,133.009422,,,,,,,,394289,���m��������,1,1,1,,,,,,1,253�l,,,,,
394289,95,����{���W�,�C���m�z�������V���E�J�C�V��,,394289,,���m�������S����������P�T�P�O�|�W,���m��,�����S����������P�T�P�O�|�W,,,,33.02185816,133.0080179,,,,,,,,394289,���m��������,1,1,1,,,,,,1,48�l,,,,,
394289,96,�������ی������Z���^�[,�N���V�I�`���E���c�z�P���t�N�V�Z���^�[,,394289,,���m�������S����������Q�O�P�V�|�P,���m��,�����S����������Q�O�P�V�|�P,,,,33.02453053,133.0112585,,0880-43-2836,,,,,,394289,���m��������,1,1,1,,,1,,,1,489�l,,,,,
394289,97,�����������쏬�w�Z,�N���V�I�`���E���c�C���m�V���E�K�b�R�E,,394289,,���m�������S����������T�T�T�U,���m��,�����S����������T�T�T�U,,,,33.02559585,133.008431,,0880-43-1016,,,,,,394289,���m��������,1,1,1,1,1,1,,,1,11451�l,,,,,
394289,98,��������������w�Z,�N���V�I�`���E���c�I�I�K�^�`���E�K���b�R�E,,394289,,���m�������S����������T�Q�Q�O,���m��,�����S����������T�Q�Q�O,,,,33.02846449,133.0088182,,0880-43-2222,,,,,,394289,���m��������,1,1,1,1,1,1,,,1,23777�l,,,,,
394289,99,���m������������w�Z,�R�E�`�P�����c�I�I�K�^�R�E�g�E�K�b�R�E,,394289,,���m�������S����������T�T�O�V,���m��,�����S����������T�T�O�V,,,,33.02711804,133.008266,,0880-43-1079,,,,,,394289,���m��������,1,1,1,1,1,1,,,1,15137�l,,,,,
394289,100,����������������ۈ珊,�N���V�I�`���E���c�I�I�K�^�`���E�I�E�z�C�N�V��,,394289,,���m�������S����������T�U�X�T,���m��,�����S����������T�U�X�T,,,,33.0277,133.006404,,0880-43-0511,,,,,,394289,���m��������,1,1,1,1,1,1,,,1,8855�l,,,,,
394289,101,�і�V�l�e�̉�,�j�V�L�m���E�W���C�R�C�m�C�G,,394289,,���m�������S����������T�P�X�U�|�U�V,���m��,�����S����������T�P�X�U�|�U�V,,,,33.03071456,133.0061621,,,,,,,,394289,���m��������,1,1,1,,,,,,1,45�l,,,,,
394289,102,���������ӂꂠ���Z���^�[�ɂ����̍L��,�A�b�^�J�t���A�C�Z���^�[�j�V�L�m�q���o,,394289,,���m�������S����������T�P�X�P�|�Q�Q,���m��,�����S����������T�P�X�P�|�Q�Q,,,,33.030262,133.008527,,0880-43-3630,,,,,,394289,���m��������,1,1,1,,,1,,,1,106�l,,,,,
394289,103,�ŏW�,�V�o�V���E�J�C�V��,,394289,,���m�������S����������P�P�X�U�|�P,���m��,�����S����������P�P�X�U�|�P,,,,33.021366,133.005167,,,,,,,,394289,���m��������,1,1,1,,,,,,1,94�l,,,,,
394289,104,���n�׏W���Z���^�[,�V���E�}�j�V���E���N�Z���^�[,,394289,,���m�������S�������n�ׂR�Q�R�X,���m��,�����S�������n�ׂR�Q�R�X,,,,33.0413737,132.9714152,,,,,,,,394289,���m��������,1,1,,,,1,,,1,292�l,,,,,
394289,105,���n�׏W���Z���^�[,�i�J�E�}�j�V���E���N�Z���^�[,,394289,,���m�������S�������n�ׂQ�W�T�S�|�S,���m��,�����S�������n�ׂQ�W�T�S�|�S,,,,33.048818,132.970681,,,,,,,,394289,���m��������,1,1,,,,1,,,1,88�l,,,,,
394289,106,�����������n�׏��w�Z,�L���E�N���V�I�`���E���c�E�}�j�V���E�K�b�R�E,,394289,,���m�������S�������n�ׂR�Q�T�X,���m��,�����S�������n�ׂR�Q�T�X,,,,33.04182339,132.9702404,,0880-43-3306,,,,,,394289,���m��������,1,1,,1,,1,,,1,4335�l,,,,,
394289,107,����k��W�,�I�I�K�^�^�`�o�i�K���V���E�J�C�V��,,394289,,���m�������S����������k��T�R�X�|�Q,���m��,�����S����������k��T�R�X�|�Q,,,,33.04666861,132.9875326,,,,,,,,394289,���m��������,1,1,,1,,1,,,1,31�l,,,,,
394289,108,��V���W�,�I���{�E�o�^�V���E�J�C�V��,,394289,,���m�������S��������V���P�R�O,���m��,�����S��������V���P�R�O,,,,33.021955,132.980592,,,,,,,,394289,���m��������,1,1,,1,,1,,,1,241�l,,,,,
394289,109,���������c�m�����w�Z,�N���V�I�`���E���c�^�m�N�`�V���E�K�b�R�E,,394289,,���m�������S���������c�̌��P�X�Q�T,���m��,�����S���������c�̌��P�X�Q�T,,,,33.01583181,132.9916187,,0880-43-1119,,,,,,394289,���m��������,,,,,,1,,,1,5533�l,,,,,