�S���n�������c�̃R�[�h,ID,�n�������c�̖�,����,����_�J�i,����_�p��,���ݒn_�S���n�������c�̃R�[�h,����ID,���ݒn_�A���\�L,���ݒn_�s���{��,���ݒn_�s�撬��,���ݒn_����,���ݒn_�Ԓn�ȉ�,��������(����),�ܓx,�o�x,���x�̎��,���x�̒l,�ݒu�ʒu,�d�b�ԍ�,�����ԍ�,�A���惁�[���A�h���X,�A����FormURL,�A������l�i���̑��ASNS�Ȃǁj,�X�֔ԍ�,�@�l�ԍ�,�c�̖�,���p�\�j��,�J�n����,�I������,���p�\�������L����,�����Ή��ݔ��̗L��,URL,�摜1,�摜1_���C�Z���X,�摜2,�摜2_���C�Z���X,�O�����p�s��,���l
394289,1,���m��������,����h�ԏ�,�X�Y�V���E�{�E�g���V��,,394289,,���m�������S��������R�P�V�Ԓn,���m��,�����S��������R�P�V�Ԓn,,,,,,,,���h�ԏ��i�ԗ����j��,,,,,,,,,���ΐ��؋��y��,0:00,23:59,,,,,,,,,
394289,2,���m��������,�s�쐣�W�,�C�`�m�Z�V���E�J�C�V��,,394289,,���m�������S��������s�쐣547�Ԓn1,���m��,�����S��������s�쐣547�Ԓn1,,,,,,,,�W���,,,,,,,,,���ΐ��؋��y��,,,���i�͌����������Ă��邽�ߗ��p�s�B�Ǘ��҂ւ̐\�������K�v�B�Ǘ��҂ւ̐\�������K�v�B,,,,,,,,
394289,3,���m��������,���m�쏬�w�Z,�R�u�V�m�J���V���E�K�b�R�E,,394289,,���m�������S���������m��243�Ԓn,���m��,�����S���������m��243�Ԓn,,,,,,,,�E��������,,,,,,,,,���ΐ��؋�,8:15,16:45,,,,,,,,,
394289,4,���m��������,�����������ی��Z���^�[,�N���V�I�`���E�\�E�S�E�z�P���Z���^�[,,394289,,���m�������S���������m��31�Ԓn3,���m��,�����S���������m��31�Ԓn3,,,,,,,,����������,,,,,,,,,���ΐ��؋�,8:30,17:15,,,,,,,,,
394289,5,���m��������,�쉜�W�,�J���I�N�V���E�J�C�V��,,394289,,���m�������S�������쉜289�Ԓn,���m��,�����S�������쉜289�Ԓn,,,,,,,,�W���,,,,,,,,,���ΐ��؋��y��,,,���i�͌����������Ă��邽�ߗ��p�s�B�Ǘ��҂ւ̐\�������K�v�B,,,,,,,,
394289,6,���m��������,�����m��W�,�R�O���m�J���V���E�J�C�V��,,394289,,���m�������S�����������̐�156�Ԓn,���m��,�����S�����������̐�156�Ԓn,,,,,,,,�W���,,,,,,,,,���ΐ��؋��y��,,,���i�͌����������Ă��邽�ߗ��p�s�B�Ǘ��҂ւ̐\�������K�v�B,,,,,,,,
394289,7,���m��������,���m��W�,�i�J�m�J���V���E�J�C�V��,,394289,,���m�������S���������m��166�Ԓn,���m��,�����S���������m��166�Ԓn,,,,,,,,�W���,,,,,,,,,���ΐ��؋��y��,,,���i�͌����������Ă��邽�ߗ��p�s�B�Ǘ��҂ւ̐\�������K�v�B,,,,,,,,
394289,8,���m��������,�F��Y�W�,�N�}�m�E���V���E�J�C�V��,,394289,,���m�������S�������F��Y90�Ԓn3,���m��,�����S�������F��Y90�Ԓn3,,,,,,,,�W���,,,,,,,,,���ΐ��؋��y��,,,���i�͌����������Ă��邽�ߗ��p�s�B�Ǘ��҂ւ̐\�������K�v�B,,,,,,,,
394289,9,���m��������,�s��X��W�,�C�`�m�m�K���V���E�J�C�V��,,394289,,���m�������S�������s��X��,���m��,�����S�������s��X��,,,,,,,,�W���,,,,,,,,,���ΐ��؋��y��,,,���i�͌����������Ă��邽�ߗ��p�s�B�Ǘ��҂ւ̐\�������K�v�B,,,,,,,,
394289,10,���m��������,�ɗ^�쏬�w�Z,�C���L�V���E�K�b�R�E,,394289,,���m�������S�������ɗ^��78�Ԓn,���m��,�����S�������ɗ^��78�Ԓn,,,,,,,,��������,,,,,,,,,���ΐ��؋�,8:00,16:30,,,,,,,,,
394289,11,���m��������,�����X�ёg��,�o���h�E�V�������N�~�A�C,,394289,,���m�������S�������F��346�Ԓn8,���m��,�����S�������F��346�Ԓn8,,,,,,,,��������,,,,,,,,,���ΐ��؋�,,,,,,,,,,,
394289,12,���m��������,���������ꍲ��x��,�N���V�I�`���E���N�o�@�T�K�V�V��,,394289,,���m�������S����������1092�Ԓn,���m��,�����S����������1092�Ԓn,,,,,,,,�����O,,,,,,,,,���ΐ��؋�,8:30,17:15,�y���ɂ��ẮA�h���ɐ��������邱�Ƃŗ��p�\�B,,,,,,,,
394289,13,���m��������,����������ψ���,�N���V�I�`���E�L���E�C�N�C�C���J�C,,394289,,���m�������S����������5893�Ԓn,���m��,�����S����������5893�Ԓn,,,,,,,,����ψ����,,,,,,,,,���ΐ��؋�,8:30,17:15,�y���ɂ��ẮA�h���ɐ��������邱�Ƃŗ��p�\�B,,,,,,,,
394289,14,���m��������,���ꏬ�w�Z,�T�K�V���E�K�b�R�E,,394289,,���m�������S����������960�Ԓn,���m��,�����S����������960�Ԓn,,,,,,,,�E����,,,,,,,,,���ΐ��؋�,8:10,16:40,,,,,,,,,
394289,15,���m��������,���ꒆ�w�Z,�T�K�`���E�K�b�R�E,,394289,,���m�������S����������600�Ԓn,���m��,�����S����������600�Ԓn,,,,,,,,����,,,,,,,,,���ΐ��؋�,8:05,16:35,,,,,,,,,
394289,16,���m��������,����ۈ珊,�T�K�z�C�N�V��,,394289,,���m�������S�������ɗ^��699�Ԓn1,���m��,�����S�������ɗ^��699�Ԓn1,,,,,,,,����,,,,,,,,,���ΐ��؋��y,7:30,18:30,�y�j���ɂ��ẮA�y�j�ۈ�̗��p���Ȃ��ꍇ�͗��p�s�B,,,,,,,,
394289,17,���m��������,�������h��,�N���V�I�V���E�{�E�V��,,394289,,���m�������S�������ɓc2629�Ԓn1,���m��,�����S�������ɓc2629�Ԓn1,,,,,,,,�~�}�ԓ��A����,,,,,,,,,���ΐ��؋��y��,0:00,23:59,,,,,,,,,�Q�䂠��
394289,18,���m��������,���ɓc���w�Z,�L���E�C�_�V���E�K�b�R�E,,394289,,���m�������S�������ɓc565�Ԓn,���m��,�����S�������ɓc565�Ԓn,,,,,,,,�̈��,,,,,,,,,���ΐ��؋��y��,,,���i�͌����������Ă��邽�ߗ��p�s�B�Ǘ��҂ւ̐\�������K�v�B,,,,,,,,
394289,19,���m��������,吐쌒�N�x���Z���^�[,�~�i�K���P���R�E�V�G���Z���^�[,,394289,,���m�������S������吐�666�Ԓn,���m��,�����S������吐�666�Ԓn,,,,,,,,�h�������֑O,,,,,,,,,���ΐ��؋��y��,,,���i�͌����������Ă��邽�ߗ��p�s�B�Ǘ��҂ւ̐\�������K�v�B,,,,,,,,
394289,20,���m��������,������W�,�i�J�u�R�E�V���E�J�C�V��,,394289,,���m�������S������吐�3649�Ԓn1,���m��,�����S������吐�3649�Ԓn1,,,,,,,,�W���,,,,,,,,,���ΐ��؋��y��,,,���i�͌����������Ă��邽�ߗ��p�s�B�Ǘ��҂ւ̐\�������K�v�B,,,,,,,,
394289,21,���m��������,�����Y�W�,�o���_���E�V���E�J�C�V��,,394289,,���m�������S������吐�3713�Ԓn13,���m��,�����S������吐�3713�Ԓn13,,,,,,,,�W����i�����ĉ��̒I�j,,,,,,,,,���ΐ��؋��y��,,,���i�͌����������Ă��邽�ߗ��p�s�B�Ǘ��҂ւ̐\�������K�v�B,,,,,,,,
394289,22,���m��������,�Č��W�,�R���n���V���E�J�C�V��,,394289,,���m�������S������吐�2630�Ԓn,���m��,�����S������吐�2630�Ԓn,,,,,,,,�W����i�����t�߁j,,,,,,,,,���ΐ��؋��y��,,,���i�͌����������Ă��邽�ߗ��p�s�B�Ǘ��҂ւ̐\�������K�v�B,,,,,,,,
394289,23,���m��������,�������w�Z,�J�~�J���O�`�V���E�K�b�R�E,,394289,,���m�������S����������569�Ԓn,���m��,�����S����������569�Ԓn,,,,,,,,����,,,,,,,,,���ΐ��؋�,8:15,16:45,,,,,,,,,
394289,24,���m��������,���������ۈ珊,�I�I�K�^�N�W���z�C�N�V��,,394289,,���m�������S����������1068�Ԓn1,���m��,�����S����������1068�Ԓn1,,,,,,,,����,,,,,,,,,���ΐ��؋��y,7:30,18:30,�y�j���ɂ��ẮA�y�j�ۈ�̗��p���Ȃ��ꍇ�͗��p�s�B,,,,,,,,
394289,25,���m��������,�������N�̉�,�n�^�Z�C�V���E�l���m�C�G,,394289,,���m�������S����������1166�Ԓn,���m��,�����S����������1166�Ԓn,,,,,,,,��������,,,,,,,,,���ΐ��؋��y��,8:30,17:15,,,,,,,,,
394289,26,���m��������,����ӂꂠ���Z���^�[,�~�i�g�K���t���A�C�Z���^�[,,394289,,���m�������S������������3091�Ԓn,���m��,�����S������������3091�Ԓn,,,,,,,,�{�ݓ��i�����t�߁j,,,,,,,,,���ΐ��؋��y��,,,���i�͌����������Ă��邽�ߗ��p�s�B�Ǘ��҂ւ̐\�������K�v�B,,,,,,,,
394289,27,���m��������,���̉w�r�I�X���������u�ЂȂ���v,�~�`�m�G�L�r�I�X�I�I�K�^�q�i�^��,,394289,,���m�������S����������953�Ԓn1,���m��,�����S����������953�Ԓn1,,,,,,,,���Y�ك��W��,,,,,,,,,���ΐ��؋��y��,7:00,18:00,,,,,,,,,
394289,28,���m��������,�싽���w�Z,�i���S�E�V���E�K�b�R�E,,394289,,���m�������S����������717�Ԓn,���m��,�����S����������717�Ԓn,,,,,,,,�E����,,,,,,,,,���ΐ��؋�,8:15,16:45,,,,,,,,,
394289,29,���m��������,���k�����w�Z,�L���E�z�N�S�E�V���E�K�b�R�E,,394289,,���m�������S������������850�Ԓn,���m��,�����S������������850�Ԓn,,,,,,,,�{�ݓ��i�����I�j,,,,,,,,,���ΐ��؋��y��,,,���i�͌����������Ă��邽�ߗ��p�s�B�Ǘ��҂ւ̐\�������K�v�B,,,,,,,,
394289,30,���m��������,����W�,�I�I�C�K���V���E�J�C�V��,,394289,,���m�������S����������71�Ԓn,���m��,�����S����������71�Ԓn,,,,,,,,�W����i�����t�߁j,,,,,,,,,���ΐ��؋��y��,,,���i�͌����������Ă��邽�ߗ��p�s�B�Ǘ��҂ւ̐\�������K�v�B,,,,,,,,
394289,31,���m��������,������Z,�I�I�K�^�R�E�R�E,,394289,,���m�������S����������5507�Ԓn,���m��,�����S����������5507�Ԓn,,,,,,,,���ցA�̈�قQ�K,,,,,,,,,���ΐ��؋�,,,,,,,,,,,�Q�䂠��
394289,32,���m��������,������w�Z,�I�I�K�^�`���E�K�b�R�E,,394289,,���m�������S����������5220�Ԓn,���m��,�����S����������5220�Ԓn,,,,,,,,�P���̓����ցi��Z�ɂ̑̈�ّ��j,,,,,,,,,���ΐ��؋�,8:05,16:35,,,,,,,,,
394289,33,���m��������,���쏬�w�Z,�C���m�V���E�K�b�R�E,,394289,,���m�������S����������5556�Ԓn,���m��,�����S����������5556�Ԓn,,,,,,,,�E�����O�L��,,,,,,,,,���ΐ��؋�,8:10,16:40,,,,,,,,,
394289,34,���m��������,��������ۈ珊,�I�I�K�^�`���E�I�E�z�C�N�V��,,394289,,���m�������S����������5695�Ԓn,���m��,�����S����������5695�Ԓn,,,,,,,,����,,,,,,,,,���ΐ��؋��y,7:30,18:30,�y�j���ɂ��ẮA�y�j�ۈ�̗��p���Ȃ��ꍇ�͗��p�s�B,,,,,,,,
394289,35,���m��������,����������{��,�N���V�I�`���E���N�o�@�z���`���E,,394289,,���m�������S����������5893�Ԓn,���m��,�����S����������5893�Ԓn,,,,,,,,�o�[���O�i���֏o�����j,,,,,,,,,���ΐ��؋��y��,8:30,17:15,�y���ɂ��ẮA�h���ɐ��������邱�Ƃŗ��p�\�B,,,,,,,,
394289,36,���m��������,����������Y�Ɛ��i��,�N���V�I�`���E���N�o�@�T���M���E�X�C�V���V�c,,394289,,���m�������S����������5893�Ԓn,���m��,�����S����������5893�Ԓn,,,,,,,,����1�K�q�ɓ�,0880-43-2113,,,,,,,,���ΐ��؋��y��,8:30,17:15,�y���ɂ��ẮA�h���ɐ��������邱�Ƃŗ��p�\�B,,,,,,,,2�䂠��
394289,37,���m��������,�����������,�I�I�K�^�A�J�c�L�J��,,394289,,���m�������S����������6931�Ԓn3,���m��,�����S����������6931�Ԓn3,,,,,,,,���������i�ْ��ȁj,,,,,,,,,���ΐ����y��,9:30,18:00,,,,,,,,,
394289,38,���m��������,���싙���E�H�b�`���O�Z���^�[,�C���m�M���L���E�E�H�b�`���O�Z���^�[,,394289,,���m�������S����������227-��,���m��,�����S����������227-��,,,,,,,,��t,,,,,,,,,���ΐ��؋��y��,,,�z�G�[���E�H�b�`���O�̗\�񂪂���ꍇ�͗��p�\�B,,,,,,,,
394289,39,���m��������,�y�������K�͌����̈��,�g�T�Z�C�i���_�C�L�{�R�E�G���^�C�C�N�J��,,394289,,���m�������S����������388�Ԓn,���m��,�����S����������388�Ԓn,,,,,,,,��������,0880-43-0166,,,,,,,,�����؋��y��,8:30,17:00,�Ηj���ɂ��ẮA�j���̏ꍇ�A���p�\�B,,,,,,,,�R�䂠��
394289,40,���m��������,�c�m�����w�Z,�^�m�N���V���E�K�b�R�E,,394289,,���m�������S���������c�̌�1925�Ԓn,���m��,�����S���������c�̌�1925�Ԓn,,,,,,,,�E����,,,,,,,,,���ΐ��؋�,8:15,16:45,,,,,,,,,
394289,41,���m��������,��V���W�,�I���{�E�o�^�V���E�J�C�V��,,394289,,���m�������S��������V��130�Ԓn,���m��,�����S��������V��130�Ԓn,,,,,,,,�W����m�ݔ�����,,,,,,,,,���ΐ��؋��y��,,,���i�͌����������Ă��邽�ߗ��p�s�B�Ǘ��҂ւ̐\�������K�v�B,,,,,,,,
394289,42,���m��������,����k��W�,�I�I�K�^�^�`�o�i�K���V���E�J�C�V��,,394289,,���m�������S����������k��539�Ԓn2,���m��,�����S����������k��539�Ԓn2,,,,,,,,�W����i�����t�߁j,,,,,,,,,���ΐ��؋��y��,,,���i�͌����������Ă��邽�ߗ��p�s�B�Ǘ��҂ւ̐\�������K�v�B,,,,,,,,
394289,43,���m��������,���n�׏��w�Z,�L���E�E�}�j�V���E�K�b�R�E,,394289,,���m�������S�������n��3259�Ԓn,���m��,�����S�������n��3259�Ԓn,,,,,,,,�{�ݓ�,,,,,,,,,���ΐ��؋��y��,,,,,,,,,,,
394289,44,���m��������,�c��Y�W�,�^�m�E���V���E�J�C�V��,,394289,,���m�������S�������c��Y2706�Ԓn3,���m��,�����S�������c��Y2706�Ԓn3,,,,,,,,�{�ݓ��i���֍����̕����j,,,,,,,,,���ΐ��؋��y��,,,���i�͌����������Ă��邽�ߗ��p�s�B�Ǘ��҂ւ̐\�������K�v�B,,,,,,,,
394289,45,���m��������,�암�ۈ珊,�i���u�z�C�N�V��,,394289,,���m�������S�������c��Y164�Ԓn2,���m��,�����S�������c��Y164�Ԓn2,,,,,,,,����,,,,,,,,,���ΐ��؋�,,,�y�j���ɂ��ẮA�y�j�ۈ�̗��p���Ȃ��ꍇ�͗��p�s�B,,,,,,,,
394289,46,���m��������,�O�Y���w�Z,�~�E���V���E�K�b�R�E,,394289,,���m�������S�������o��2480�Ԓn,���m��,�����S�������o��2480�Ԓn,,,,,,,,�ی����̍Z�둤�̑���,,,,,,,,,���ΐ��؋�,8:15,16:45,,,,,,,,,
394289,47,���m��������,���������,�I�I�K�^�`���E�~���J��,,394289,,���m�������S����������833�Ԓn1,���m��,�����S����������833�Ԓn1,,,,,,,,����,,,,,,,,,���ΐ��؋�,8:30,17:15,,,,,,,,,
394289,48,���m��������,���������,�I�I�K�^�W�h�E�J��,,394289,,���m�������S����������873�Ԓn3,���m��,�����S����������873�Ԓn3,,,,,,,,����,,,,,,,,,���ΐ��؋�,9:30,18:15,,,,,,,,,
394289,49,���m��������,�l������W�,�n�}�}�c�L���E�C�N�V���E�J�C�V��,,394289,,���m�������S����������841�Ԓn5,���m��,�����S����������841�Ԓn5,,,,,,,,���։��ʔ�,,,,,,,,,���ΐ��؋�,8:30,17:15,,,,,,,,,
394289,50,���m��������,�y�����ꉷ�򂱂Ԃ��̂���,�g�T�T�K�I���Z���R�u�V�m�T�g,,394289,,���m�������S���������m��2161�Ԓn,���m��,�����S���������m��2161�Ԓn,,,,,,,,�t�����g,,,,,,,,,���ΐ��؋��y��,11:00,21:00,,,,,,,,,
394289,51,���m��������,������Гy������,�J�u�V�L�K�C�V���h�C�P���Z�c,,394289,,���m�������S�������ɗ^��43�Ԓn5,���m��,�����S�������ɗ^��43�Ԓn5,,,,,,,,��������,,,,,,,,,���ΐ��؋�,,,,,,,,,,,
394289,52,���m��������,������ЂȂԂ�y������,�J�u�V�L�K�C�V���i�u���g�T�T�K,,394289,,���m�������S����������1351�Ԓn,���m��,�����S����������1351�Ԓn,,,,,,,,��������,,,,,,,,,���ΐ��؋��y��,8:00,18:00,,,,,,,,,
394289,53,���m��������,�����M�p���ɍ���x�X,�n�^�V�����E�L���R�T�K�V�e��,,394289,,���m�������S����������657�Ԓn1,���m��,�����S����������657�Ԓn1,,,,,,,,��������,,,,,,,,,���ΐ��؋�,9:00,15:00,,,,,,,,,
394289,54,���m��������,������Гy��������y��հ��߱���ذ����,�J�u�V�L�K�C�V���g�T�Z�C�i���L�J�N�g�T���[�g�s�A�J���g���[�N���u,,394289,,���m�������S����������3878�Ԓn,���m��,�����S����������3878�Ԓn,,,,,,,,�t�����g�O,0880-43-2345,,,,,,,,���ΐ��؋��y��,8:00,17:00,,,,,,,,,1�䂠��
394289,55,���m��������,�������Ȉ�@,���X�~�c�V�J�C�C��,,394289,,���m�������S����������2581�Ԓn1,���m��,�����S����������2581�Ԓn1,,,,,,,,��t,,,,,,,,,���ΐ����y,9:00,18:00,,,,,,,,,
394289,56,���m��������,�����M�p���ɓ���x�X,�n�^�V�����E�L���R�C���m�V�e��,,394289,,���m�������S����������2079�Ԓn1,���m��,�����S����������2079�Ԓn1,,,,,,,,��������,,,,,,,,,���ΐ��؋�,9:00,15:00,,,,,,,,,
394289,57,���m��������,�l�X�g�E�E�G�X�g�K�[�f���y��,�l�X�g�E�G�X�g�K�[�f���g�T,,394289,,���m�������S����������184�Ԓn,���m��,�����S����������184�Ԓn,,,,,,,,��������,0880-43-0101,,,,,,,,���ΐ��؋��y��,8:00,20:30,,,,,,,,,�P�䂠��
394289,58,���m��������,�����������{�ݑg�����������֏�,�n�^�`���E�I�E�J���L���E�V�Z�c�N�~�A�C�n�^�`���E�I�E�T�C�W���E,,394289,,���m�������S�������o��2771-2,���m��,�����S�������o��2771-2,,,,,,,,�{�ݓ�,,,,,,,,,���ΐ��؋��y��,,,,,,,,,,,
394289,59,���m��������,�ӂ邳�Ƒ����Z���^�[,�t���T�g�\�E�S�E�Z���^�[,,394289,,���m�������S����������176-2,���m��,�����S����������176-2,,,,,,,,��������,0880-43-3369,,,,,,,,���ΐ��؋��y��,,,�x�ٓ��F�N���N�n�i12/29�`1/3�j ,,,,,,,,�P�䂠��
